BDBM92406 PDK1 inhibitor, 7
SMILES Fc1ccc(Cn2cccc(C(=O)NC(COc3ccc4[nH]c(=O)[nH]c4c3)c3ccccc3)c2=O)cc1F
InChI Key InChIKey=AHMXYULEXZAPCS-UHFFFAOYSA-N
Data  1 EC50
PDB links: 2 PDB IDs match this monomer.
  Tab Delimited (TSV)   2D SDfile   Computed 3D by Vconf -m prep SDfile
Find this compound or compounds like it in BindingDB:
Activity Spreadsheet -- Enzyme Inhibition Constant Data from BindingDB
Found 1 hit for monomerid = 92406
Target3-phosphoinositide-dependent protein kinase 1(Homo sapiens (Human))
Merck Research Laboratories
LigandPNGBDBM92406(PDK1 inhibitor, 7)
Affinity DataEC50:  1nM. Assay description: Enzyme potency (PDK1 EC50)was determined using recombinant, purified full-length human PDK1 enzyme and AKT-Thr-308-tide as substrate.